Building VirtualBox OSE 2.1.4 on Windows (use VS2005, Qt4)

Discussions related to using the OSE version of VirtualBox.

Re: Building VirtualBox OSE 2.1.4 on Windows (use VS2005, Qt4)

Postby kingofait » 23. Mar 2009, 18:53

Thanks a lot yk700101 for your reply. Now iam able to build it successfully.
kingofait
 
Posts: 7
Joined: 23. Mar 2009, 10:13
Location: bangalore
Primary OS: MS Windows XP
VBox Version: OSE self-compiled
Guest OSses: Windows Vista,7,XP,ser2008,serv2003,Fedora 10,12,Linux 2.6 based other OSes

Re: Building VirtualBox OSE 2.1.4 on Windows (use VS2005, Qt4)

Postby TheOSEAsker » 24. Mar 2009, 10:19

Thanks for your help! Now I could build Virtualbox.
TheOSEAsker
 
Posts: 6
Joined: 20. Mar 2009, 16:38

Re: Building VirtualBox OSE 2.1.4 on Windows (use VS2005, Qt4)

Postby frank » 25. Mar 2009, 23:22

Actually icon is not necessary if you are using the shipped libxslt and libxml2 from the OSE tree. And we fixed some Windows OSE bugs in the last days, so if you compile VirtualBox OSE from the subversion repository it should work a bit better. So will the sources of the upcoming release.
frank
Oracle Corporation
 
Posts: 3362
Joined: 7. Jun 2007, 09:11
Location: Dresden, Germany
Primary OS: Debian Sid
VBox Version: PUEL
Guest OSses: Linux, Windows

gcc.exe: Einstellungen\Temp/cca03136.base": No such file or

Postby alexzeit » 7. Apr 2009, 17:46

Dear All,
I have following installation:
Code: Select all   Expand viewCollapse view
WinXp (German) Sp3

Visual Studio 2005 Professional Edition with service pack 1 (English)

tried both
  Windows Platform SDK (from Visual Studio 2005)
and
  WindowsServer 2003 R2 PlatformSDK

 
Windows Driver Development Kit
  Windows Server 2003 SP1 DDK
 
DirectX SDK
  Microsoft DirectX SDK (November 2008)

MingW
  gcc-core-3.3.1-20030804-1.tar.gz
  gcc-g++-3.3.1-20030804-1.tar.gz
  mingw-runtime-3.8.tar.gz
  w32api-3.5.tar.gz
  binutils-2.13.90-20021006-2.tar.gz

SDL
  SDL-devel-1.2.13-VC8.zip

libxml2 and libxslt1 libraries
  libxml2-sources-2.7.3.tar.gz
  libxslt-1.1.24.tar.gz

QT
  qt-win-opensource-src-4.4.3.zip



Directory tree:
Code: Select all   Expand viewCollapse view
D:\z_Build2\iconv
D:\z_Build2\libxml2-2.7.3
D:\z_Build2\libxslt-1.1.24
D:\z_Build2\mingw
D:\z_Build2\qt-win-opensource-src-4.4.3
D:\z_Build2\SDL-1.2.13
D:\z_Build2\VirtualBox-2.1.4_OSE


I have done sucessfully all described in the beginning of this thread up to the point "Building VirtualBox(make)"

My AutoConfig.kmk:
Code: Select all   Expand viewCollapse view
# -*- Makefile -*-
#
# Build configuration generated by cscript configure.vbs --with-MinGW=D:\z_Build2\mingw --with-libSDL=D:\z_Build2\SDL-1.2.13

--with-libxml2=D:\z_Build2\libxml2-2.7.3\win32 --with-libxslt=D:\z_Build2\libxslt-1.1.24\win32 --with-qt=D:\z_Build2\qt-win-opensource-src-4.4.3
#
VBOX_OSE := 1
VBOX_USE_VCC80        := 1
PATH_TOOL_VCC80       := H:/PROGRA~1/MICROS~2/VC
PATH_TOOL_VCC80X86     = $(PATH_TOOL_VCC80)
PATH_TOOL_VCC80AMD64   = $(PATH_TOOL_VCC80)
# PATH_SDK_WINPSDK      := H:/PROGRA~1/MICROS~4
PATH_SDK_WINPSDK      := H:/PROGRA~1/MICROS~2/vc/PlatformSDK
PATH_SDK_WINPSDKINCS   = $(PATH_SDK_WINPSDK)
PATH_SDK_WIN32SDK      = $(PATH_SDK_WINPSDK)
PATH_SDK_WIN64SDK      = $(PATH_SDK_WINPSDK)
PATH_SDK_W2K3DDK      := H:/PROGRA~1/WINDDK/3790~1.183
PATH_SDK_W2K3DDKX86    = $(PATH_SDK_W2K3DDK)
PATH_SDK_W2K3DDKAMD64  = $(PATH_SDK_W2K3DDK)
MAIN_IDL = H:/PROGRA~1/MICROS~4/bin/Midl.exe
PATH_TOOL_MINGW32     := D:/z_Build2/MinGW
PATH_SDK_W32API        = D:\z_Build2\mingw
PATH_SDK_LIBSDL       := D:/z_Build2/SDL-1.2.13
SDK_VBOX_LIBXML2_INCS  := D:/z_Build2/libxml2-2.7.3/win32/include
SDK_VBOX_LIBXML2_LIBS  := D:/z_Build2/libxml2-2.7.3/win32/lib/libxml2.lib
SDK_VBOX_LIBXSLT_INCS   := D:/z_Build2/libxslt-1.1.24/win32/include
SDK_VBOX_LIBXSLT_LIBS   := D:/z_Build2/libxslt-1.1.24/win32/lib/libxslt.lib
VBOX_PATH_QT          := D:/z_Build2/qt-win-opensource-src-4.4.3
QTDIR                  = $(VBOX_PATH_QT)
LIB_QT                 =
VBOX_DLL_QT            =
VBOX_WITH_QTGUI :=
PATH_SDK_QT4       := D:/z_Build2/qt-win-opensource-src-4.4.3
PATH_SDK_DXSDK        := H:/PROGRA~1/MICROS~3
PATH_SDK_DXSDKX86      = $(PATH_SDK_DXSDK)
PATH_SDK_DXSDKAMD64    = $(PATH_SDK_DXSDK)
SDK_VBOX_LIBXML2_LIBS  := D:/z_Build2/libxml2-2.7.3/win32/lib/libxml2_a.lib
SDK_VBOX_LIBXML2_LIBS  += D:/z_Build2/iconv/lib/iconv.lib
SDK_VBOX_LIBXSLT_LIBS   := D:/z_Build2/libxslt-1.1.24/win32/lib/libxslt_a.lib
PATH_SDK_LIBSDL := D:\z_Build2\SDL-1.2.13\



D:\z_Build2\build.vbox.log :

Code: Select all   Expand viewCollapse view
D:/z_Build2/VirtualBox-2.1.4_OSE/src/VBox/Main/webservice/Makefile.kmk:82: VBOX_PATH_GSOAP not found...
kBuild: Pass - Build Programs
kmk.exe[1]: Entering directory `D:/z_Build2/VirtualBox-2.1.4_OSE'
D:/z_Build2/VirtualBox-2.1.4_OSE/src/VBox/Main/webservice/Makefile.kmk:82: VBOX_PATH_GSOAP not found...
kmk.exe[2]: Entering directory `D:/z_Build2/VirtualBox-2.1.4_OSE'
D:/z_Build2/VirtualBox-2.1.4_OSE/src/VBox/Main/webservice/Makefile.kmk:82: VBOX_PATH_GSOAP not found...
kmk.exe[2]: Nothing to be done for `pass_bldprogs_doit'.
kmk.exe[2]: Leaving directory `D:/z_Build2/VirtualBox-2.1.4_OSE'
kmk.exe[1]: Leaving directory `D:/z_Build2/VirtualBox-2.1.4_OSE'
kBuild: Pass - Libraries
kmk.exe[1]: Entering directory `D:/z_Build2/VirtualBox-2.1.4_OSE'
D:/z_Build2/VirtualBox-2.1.4_OSE/src/VBox/Main/webservice/Makefile.kmk:82: VBOX_PATH_GSOAP not found...
kmk.exe[2]: Entering directory `D:/z_Build2/VirtualBox-2.1.4_OSE/src/VBox/Devices/PC/Etherboot-src'
kmk.exe[2]: Nothing to be done for `pass_libraries'.
kmk.exe[2]: Leaving directory `D:/z_Build2/VirtualBox-2.1.4_OSE/src/VBox/Devices/PC/Etherboot-src'
kmk.exe[2]: Entering directory `D:/z_Build2/VirtualBox-2.1.4_OSE'
D:/z_Build2/VirtualBox-2.1.4_OSE/src/VBox/Main/webservice/Makefile.kmk:82: VBOX_PATH_GSOAP not found...
kmk.exe[2]: Nothing to be done for `pass_libraries_doit'.
kmk.exe[2]: Leaving directory `D:/z_Build2/VirtualBox-2.1.4_OSE'
kmk.exe[1]: Leaving directory `D:/z_Build2/VirtualBox-2.1.4_OSE'
kBuild: Pass - DLLs
kmk.exe[1]: Entering directory `D:/z_Build2/VirtualBox-2.1.4_OSE'
D:/z_Build2/VirtualBox-2.1.4_OSE/src/VBox/Main/webservice/Makefile.kmk:82: VBOX_PATH_GSOAP not found...
kmk.exe[2]: Entering directory `D:/z_Build2/VirtualBox-2.1.4_OSE'
D:/z_Build2/VirtualBox-2.1.4_OSE/src/VBox/Main/webservice/Makefile.kmk:82: VBOX_PATH_GSOAP not found...
kBuild: Installing VBoxC => D:/z_Build2/VirtualBox-2.1.4_OSE/out/win.x86/release/bin/VBoxC.dll
kBuild: Installing VBoxDD => D:/z_Build2/VirtualBox-2.1.4_OSE/out/win.x86/release/bin/VBoxDD.dll
kBuild: Compiling VBoxREM32 - D:/z_Build2/VirtualBox-2.1.4_OSE/src/recompiler_new/VBoxRecompiler.c
kBuild: Compiling VBoxREM32 - D:/z_Build2/VirtualBox-2.1.4_OSE/src/recompiler_new/cpu-exec.c
kBuild: Compiling VBoxREM32 - D:/z_Build2/VirtualBox-2.1.4_OSE/src/recompiler_new/exec.c
D:/z_Build2/VirtualBox-2.1.4_OSE/src/recompiler_new/VBoxRecompiler.c: In function `REMR3NotifyPhysRamRegister':
D:/z_Build2/VirtualBox-2.1.4_OSE/src/recompiler_new/VBoxRecompiler.c:2616: warning: unused variable `cbBitmap'
D:/z_Build2/VirtualBox-2.1.4_OSE/src/recompiler_new/VBoxRecompiler.c:2617: warning: unused variable `rc'
kBuild: Compiling VBoxREM32 - D:/z_Build2/VirtualBox-2.1.4_OSE/src/recompiler_new/translate-all.c
kBuild: Compiling VBoxREM32 - D:/z_Build2/VirtualBox-2.1.4_OSE/src/recompiler_new/host-utils.c
kBuild: Compiling VBoxREM32 - D:/z_Build2/VirtualBox-2.1.4_OSE/src/recompiler_new/cutils.c
kBuild: Compiling VBoxREM32 - D:/z_Build2/VirtualBox-2.1.4_OSE/src/recompiler_new/tcg/tcg.c
kBuild: Compiling VBoxREM32 - D:/z_Build2/VirtualBox-2.1.4_OSE/src/recompiler_new/tcg/tcg-dyngen.c
kBuild: Compiling VBoxREM32 - D:/z_Build2/VirtualBox-2.1.4_OSE/src/recompiler_new/tcg/tcg-runtime.c
kBuild: Compiling VBoxREM32 - D:/z_Build2/VirtualBox-2.1.4_OSE/src/recompiler_new/fpu/softfloat-native.c
kBuild: Compiling VBoxREM32 - D:/z_Build2/VirtualBox-2.1.4_OSE/src/recompiler_new/target-i386/op_helper.c
In file included from D:/z_Build2/VirtualBox-2.1.4_OSE/src/recompiler_new/bswap.h:7,
                 from D:/z_Build2/VirtualBox-2.1.4_OSE/src/recompiler_new/cpu-all.h:57,
                 from D:/z_Build2/VirtualBox-2.1.4_OSE/src/recompiler_new/target-i386/cpu.h:1009,
                 from D:/z_Build2/VirtualBox-2.1.4_OSE/src/recompiler_new/tcg/tcg.c:61:
D:/z_Build2/mingw/include/inttypes.h:33:1: warning: "PRId32" redefined
In file included from D:/z_Build2/VirtualBox-2.1.4_OSE/src/recompiler_new/tcg/tcg.c:55:
D:/z_Build2/VirtualBox-2.1.4_OSE/src/recompiler_new/qemu-common.h:13:1: warning: this is the location of the previous definition
In file included from D:/z_Build2/VirtualBox-2.1.4_OSE/src/recompiler_new/bswap.h:7,
                 from D:/z_Build2/VirtualBox-2.1.4_OSE/src/recompiler_new/cpu-all.h:57,
                 from D:/z_Build2/VirtualBox-2.1.4_OSE/src/recompiler_new/target-i386/cpu.h:1009,
                 from D:/z_Build2/VirtualBox-2.1.4_OSE/src/recompiler_new/tcg/tcg.c:61:
D:/z_Build2/mingw/include/inttypes.h:69:1: warning: "PRIo32" redefined
In file included from D:/z_Build2/VirtualBox-2.1.4_OSE/src/recompiler_new/tcg/tcg.c:55:
D:/z_Build2/VirtualBox-2.1.4_OSE/src/recompiler_new/qemu-common.h:16:1: warning: this is the location of the previous definition
In file included from D:/z_Build2/VirtualBox-2.1.4_OSE/src/recompiler_new/bswap.h:7,
                 from D:/z_Build2/VirtualBox-2.1.4_OSE/src/recompiler_new/cpu-all.h:57,
                 from D:/z_Build2/VirtualBox-2.1.4_OSE/src/recompiler_new/target-i386/cpu.h:1009,
                 from D:/z_Build2/VirtualBox-2.1.4_OSE/src/recompiler_new/tcg/tcg.c:61:
D:/z_Build2/mingw/include/inttypes.h:89:1: warning: "PRIu32" redefined
In file included from D:/z_Build2/VirtualBox-2.1.4_OSE/src/recompiler_new/tcg/tcg.c:55:
D:/z_Build2/VirtualBox-2.1.4_OSE/src/recompiler_new/qemu-common.h:15:1: warning: this is the location of the previous definition
In file included from D:/z_Build2/VirtualBox-2.1.4_OSE/src/recompiler_new/bswap.h:7,
                 from D:/z_Build2/VirtualBox-2.1.4_OSE/src/recompiler_new/cpu-all.h:57,
                 from D:/z_Build2/VirtualBox-2.1.4_OSE/src/recompiler_new/target-i386/cpu.h:1009,
                 from D:/z_Build2/VirtualBox-2.1.4_OSE/src/recompiler_new/tcg/tcg.c:61:
D:/z_Build2/mingw/include/inttypes.h:108:1: warning: "PRIx32" redefined
In file included from D:/z_Build2/VirtualBox-2.1.4_OSE/src/recompiler_new/tcg/tcg.c:55:
D:/z_Build2/VirtualBox-2.1.4_OSE/src/recompiler_new/qemu-common.h:14:1: warning: this is the location of the previous definition
In file included from D:/z_Build2/VirtualBox-2.1.4_OSE/src/recompiler_new/tcg/tcg.c:189:
D:/z_Build2/VirtualBox-2.1.4_OSE/src/recompiler_new/tcg/i386/tcg-target.c: In function `tcg_out_qemu_st':
D:/z_Build2/VirtualBox-2.1.4_OSE/src/recompiler_new/tcg/i386/tcg-target.c:882: warning: unused variable `bias3'
D:/z_Build2/VirtualBox-2.1.4_OSE/src/recompiler_new/tcg/tcg.c: In function `tcg_dump_ops':
D:/z_Build2/VirtualBox-2.1.4_OSE/src/recompiler_new/tcg/tcg.c:833: warning: unused variable `buf'
kBuild: Compiling VBoxREM32 - D:/z_Build2/VirtualBox-2.1.4_OSE/src/recompiler_new/target-i386/helper.c
D:/z_Build2/VirtualBox-2.1.4_OSE/src/recompiler_new/target-i386/helper.c:52: warning: `add_flagname_to_bitmaps' defined but not used
kBuild: Compiling VBoxREM32 - D:/z_Build2/VirtualBox-2.1.4_OSE/src/recompiler_new/target-i386/translate.c
D:/z_Build2/VirtualBox-2.1.4_OSE/src/recompiler_new/target-i386/translate.c: In function `gen_op_mov_v_reg':
D:/z_Build2/VirtualBox-2.1.4_OSE/src/recompiler_new/target-i386/translate.c:480: warning: label `std_case' defined but not used
D:/z_Build2/VirtualBox-2.1.4_OSE/src/recompiler_new/target-i386/op_helper.c: In function `sync_seg':
D:/z_Build2/VirtualBox-2.1.4_OSE/src/recompiler_new/target-i386/op_helper.c:5661: warning: unused variable `old_buf'
D:/z_Build2/VirtualBox-2.1.4_OSE/src/recompiler_new/target-i386/op_helper.c: In function `helper_vmrun':
D:/z_Build2/VirtualBox-2.1.4_OSE/src/recompiler_new/target-i386/op_helper.c:6346: warning: unused variable `valid_err'
kBuild: Compiling VBoxREM64 - D:/z_Build2/VirtualBox-2.1.4_OSE/src/recompiler_new/VBoxRecompiler.c
D:/z_Build2/VirtualBox-2.1.4_OSE/src/recompiler_new/VBoxRecompiler.c: In function `REMR3NotifyPhysRamRegister':
D:/z_Build2/VirtualBox-2.1.4_OSE/src/recompiler_new/VBoxRecompiler.c:2616: warning: unused variable `cbBitmap'
D:/z_Build2/VirtualBox-2.1.4_OSE/src/recompiler_new/VBoxRecompiler.c:2617: warning: unused variable `rc'
kBuild: Compiling VBoxREM64 - D:/z_Build2/VirtualBox-2.1.4_OSE/src/recompiler_new/cpu-exec.c
kBuild: Compiling VBoxREM64 - D:/z_Build2/VirtualBox-2.1.4_OSE/src/recompiler_new/exec.c
D:/z_Build2/VirtualBox-2.1.4_OSE/src/recompiler_new/exec.c: In function `tlb_update_dirty':
D:/z_Build2/VirtualBox-2.1.4_OSE/src/recompiler_new/exec.c:2076: warning: cast to pointer from integer of different size
kBuild: Compiling VBoxREM64 - D:/z_Build2/VirtualBox-2.1.4_OSE/src/recompiler_new/translate-all.c
kBuild: Compiling VBoxREM64 - D:/z_Build2/VirtualBox-2.1.4_OSE/src/recompiler_new/host-utils.c
kBuild: Compiling VBoxREM64 - D:/z_Build2/VirtualBox-2.1.4_OSE/src/recompiler_new/cutils.c
kBuild: Compiling VBoxREM64 - D:/z_Build2/VirtualBox-2.1.4_OSE/src/recompiler_new/tcg/tcg.c
In file included from D:/z_Build2/VirtualBox-2.1.4_OSE/src/recompiler_new/bswap.h:7,
                 from D:/z_Build2/VirtualBox-2.1.4_OSE/src/recompiler_new/cpu-all.h:57,
                 from D:/z_Build2/VirtualBox-2.1.4_OSE/src/recompiler_new/target-i386/cpu.h:1009,
                 from D:/z_Build2/VirtualBox-2.1.4_OSE/src/recompiler_new/tcg/tcg.c:61:
D:/z_Build2/mingw/include/inttypes.h:33:1: warning: "PRId32" redefined
In file included from D:/z_Build2/VirtualBox-2.1.4_OSE/src/recompiler_new/tcg/tcg.c:55:
D:/z_Build2/VirtualBox-2.1.4_OSE/src/recompiler_new/qemu-common.h:13:1: warning: this is the location of the previous definition
In file included from D:/z_Build2/VirtualBox-2.1.4_OSE/src/recompiler_new/bswap.h:7,
                 from D:/z_Build2/VirtualBox-2.1.4_OSE/src/recompiler_new/cpu-all.h:57,
                 from D:/z_Build2/VirtualBox-2.1.4_OSE/src/recompiler_new/target-i386/cpu.h:1009,
                 from D:/z_Build2/VirtualBox-2.1.4_OSE/src/recompiler_new/tcg/tcg.c:61:
D:/z_Build2/mingw/include/inttypes.h:69:1: warning: "PRIo32" redefined
In file included from D:/z_Build2/VirtualBox-2.1.4_OSE/src/recompiler_new/tcg/tcg.c:55:
D:/z_Build2/VirtualBox-2.1.4_OSE/src/recompiler_new/qemu-common.h:16:1: warning: this is the location of the previous definition
In file included from D:/z_Build2/VirtualBox-2.1.4_OSE/src/recompiler_new/bswap.h:7,
                 from D:/z_Build2/VirtualBox-2.1.4_OSE/src/recompiler_new/cpu-all.h:57,
                 from D:/z_Build2/VirtualBox-2.1.4_OSE/src/recompiler_new/target-i386/cpu.h:1009,
                 from D:/z_Build2/VirtualBox-2.1.4_OSE/src/recompiler_new/tcg/tcg.c:61:
D:/z_Build2/mingw/include/inttypes.h:89:1: warning: "PRIu32" redefined
In file included from D:/z_Build2/VirtualBox-2.1.4_OSE/src/recompiler_new/tcg/tcg.c:55:
D:/z_Build2/VirtualBox-2.1.4_OSE/src/recompiler_new/qemu-common.h:15:1: warning: this is the location of the previous definition
In file included from D:/z_Build2/VirtualBox-2.1.4_OSE/src/recompiler_new/bswap.h:7,
                 from D:/z_Build2/VirtualBox-2.1.4_OSE/src/recompiler_new/cpu-all.h:57,
                 from D:/z_Build2/VirtualBox-2.1.4_OSE/src/recompiler_new/target-i386/cpu.h:1009,
                 from D:/z_Build2/VirtualBox-2.1.4_OSE/src/recompiler_new/tcg/tcg.c:61:
D:/z_Build2/mingw/include/inttypes.h:108:1: warning: "PRIx32" redefined
In file included from D:/z_Build2/VirtualBox-2.1.4_OSE/src/recompiler_new/tcg/tcg.c:55:
D:/z_Build2/VirtualBox-2.1.4_OSE/src/recompiler_new/qemu-common.h:14:1: warning: this is the location of the previous definition
D:/z_Build2/VirtualBox-2.1.4_OSE/src/recompiler_new/tcg/tcg.c: In function `tcg_dump_ops':
D:/z_Build2/VirtualBox-2.1.4_OSE/src/recompiler_new/tcg/tcg.c:833: warning: unused variable `buf'
kBuild: Compiling VBoxREM64 - D:/z_Build2/VirtualBox-2.1.4_OSE/src/recompiler_new/tcg/tcg-dyngen.c
kBuild: Compiling VBoxREM64 - D:/z_Build2/VirtualBox-2.1.4_OSE/src/recompiler_new/tcg/tcg-runtime.c
kBuild: Compiling VBoxREM64 - D:/z_Build2/VirtualBox-2.1.4_OSE/src/recompiler_new/fpu/softfloat-native.c
kBuild: Compiling VBoxREM64 - D:/z_Build2/VirtualBox-2.1.4_OSE/src/recompiler_new/target-i386/op_helper.c
D:/z_Build2/VirtualBox-2.1.4_OSE/src/recompiler_new/target-i386/op_helper.c: In function `sync_seg':
D:/z_Build2/VirtualBox-2.1.4_OSE/src/recompiler_new/target-i386/op_helper.c:5661: warning: unused variable `old_buf'
D:/z_Build2/VirtualBox-2.1.4_OSE/src/recompiler_new/target-i386/op_helper.c: In function `helper_vmrun':
D:/z_Build2/VirtualBox-2.1.4_OSE/src/recompiler_new/target-i386/op_helper.c:6346: warning: unused variable `valid_err'
kBuild: Compiling VBoxREM64 - D:/z_Build2/VirtualBox-2.1.4_OSE/src/recompiler_new/target-i386/helper.c
D:/z_Build2/VirtualBox-2.1.4_OSE/src/recompiler_new/target-i386/helper.c:52: warning: `add_flagname_to_bitmaps' defined but not used
kBuild: Compiling VBoxREM64 - D:/z_Build2/VirtualBox-2.1.4_OSE/src/recompiler_new/target-i386/translate.c
D:/z_Build2/VirtualBox-2.1.4_OSE/src/recompiler_new/target-i386/translate.c: In function `gen_op_mov_v_reg':
D:/z_Build2/VirtualBox-2.1.4_OSE/src/recompiler_new/target-i386/translate.c:480: warning: label `std_case' defined but not used
D:/z_Build2/VirtualBox-2.1.4_OSE/src/recompiler_new/tcg/tcg-op.h: At top level:
D:/z_Build2/VirtualBox-2.1.4_OSE/src/recompiler_new/target-i386/translate.c:901: warning: `gen_check_external_event2' defined but not used
kBuild: Linking VBoxREM32
gcc.exe: Einstellungen\Temp/cca03136.base": No such file or directory
D:/z_Build2/MinGW/bin/dllwrap.exe: D:/z_Build2/MinGW/bin/gcc.exe exited with status 1
kmk.exe[2]: *** [D:/z_Build2/VirtualBox-2.1.4_OSE/out/win.x86/release/obj/VBoxREM32/VBoxREM32.dll] Error 1
The failing command:
@D:/z_Build2/MinGW/bin/dllwrap.exe  -s                         

--dllname=D:/z_Build2/VirtualBox-2.1.4_OSE/out/win.x86/release/obj/VBoxREM32/VBoxREM32.dll

--output-exp=D:/z_Build2/VirtualBox-2.1.4_OSE/out/win.x86/release/obj/VBoxREM32/VBoxREM32.exp

--output-lib=D:/z_Build2/VirtualBox-2.1.4_OSE/out/win.x86/release/obj/VBoxREM32/VBoxREM32.a  --def

D:/z_Build2/VirtualBox-2.1.4_OSE/src/recompiler_new/VBoxREM.def  D:/z_Build2/VirtualBox-2.1.4_OSE/out/win.x86/release/obj/VBoxREM32/VBoxRecompiler.o

D:/z_Build2/VirtualBox-2.1.4_OSE/out/win.x86/release/obj/VBoxREM32/cpu-exec.o

D:/z_Build2/VirtualBox-2.1.4_OSE/out/win.x86/release/obj/VBoxREM32/exec.o

D:/z_Build2/VirtualBox-2.1.4_OSE/out/win.x86/release/obj/VBoxREM32/translate-all.o

D:/z_Build2/VirtualBox-2.1.4_OSE/out/win.x86/release/obj/VBoxREM32/host-utils.o

D:/z_Build2/VirtualBox-2.1.4_OSE/out/win.x86/release/obj/VBoxREM32/cutils.o

D:/z_Build2/VirtualBox-2.1.4_OSE/out/win.x86/release/obj/VBoxREM32/tcg/tcg.o

D:/z_Build2/VirtualBox-2.1.4_OSE/out/win.x86/release/obj/VBoxREM32/tcg/tcg-dyngen.o

D:/z_Build2/VirtualBox-2.1.4_OSE/out/win.x86/release/obj/VBoxREM32/tcg/tcg-runtime.o

D:/z_Build2/VirtualBox-2.1.4_OSE/out/win.x86/release/obj/VBoxREM32/fpu/softfloat-native.o

D:/z_Build2/VirtualBox-2.1.4_OSE/out/win.x86/release/obj/VBoxREM32/target-i386/op_helper.o

D:/z_Build2/VirtualBox-2.1.4_OSE/out/win.x86/release/obj/VBoxREM32/target-i386/helper.o

D:/z_Build2/VirtualBox-2.1.4_OSE/out/win.x86/release/obj/VBoxREM32/target-i386/translate.o  -LD:/z_Build2/mingw/lib   

D:/z_Build2/VirtualBox-2.1.4_OSE/out/win.x86/release/lib/VBoxVMM.lib   D:/z_Build2/VirtualBox-2.1.4_OSE/out/win.x86/release/lib/VBoxRT.lib
kmk.exe[2]: *** Waiting for unfinished jobs....
D:/z_Build2/VirtualBox-2.1.4_OSE/src/recompiler_new/target-i386/translate.c: At top level:
D:/z_Build2/VirtualBox-2.1.4_OSE/src/recompiler_new/target-i386/translate.c:901: warning: `gen_check_external_event2' defined but not used
kmk.exe[2]: Leaving directory `D:/z_Build2/VirtualBox-2.1.4_OSE'
kmk.exe[2]: Entering directory `D:/z_Build2/VirtualBox-2.1.4_OSE'
kmk.exe[2]: *** Exiting with status 2
kmk.exe[1]: *** [pass_dlls_this] Error 2
kmk.exe[1]: Leaving directory `D:/z_Build2/VirtualBox-2.1.4_OSE'
kmk: *** [pass_dlls_order] Error 2
alexzeit
 
Posts: 12
Joined: 3. Apr 2009, 14:39
Primary OS: MS Windows XP
VBox Version: OSE other
Guest OSses: Linux

Please try "dllwrap.exe --base-file temp.base ..."

Postby yk700101 » 8. Apr 2009, 03:53

alexzeit wrote:
Code: Select all   Expand viewCollapse view
kBuild: Linking VBoxREM32
gcc.exe: Einstellungen\Temp/cca03136.base": No such file or directory
D:/z_Build2/MinGW/bin/dllwrap.exe: D:/z_Build2/MinGW/bin/gcc.exe exited with status 1
kmk.exe[2]: *** [D:/z_Build2/VirtualBox-2.1.4_OSE/out/win.x86/release/obj/VBoxREM32/VBoxREM32.dll] Error 1
The failing command:
@D:/z_Build2/MinGW/bin/dllwrap.exe  -s --dllname=D:/z_Build2/VirtualBox-2.1.4_OSE/out/win.x86/release/obj/VBoxREM32/VBoxREM32.dll --output-exp=D:/z_Build2/VirtualBox-2.1.4_OSE/out/win.x86/release/obj/VBoxREM32/VBoxREM32.exp --output-lib=D:/z_Build2/VirtualBox-2.1.4_OSE/out/win.x86/release/obj/VBoxREM32/VBoxREM32.a  --def D:/z_Build2/VirtualBox-2.1.4_OSE/src/recompiler_new/VBoxREM.def  D:/z_Build2/VirtualBox-2.1.4_OSE/out/win.x86/release/obj/VBoxREM32/VBoxRecompiler.o D:/z_Build2/VirtualBox-2.1.4_OSE/out/win.x86/release/obj/VBoxREM32/cpu-exec.o D:/z_Build2/VirtualBox-2.1.4_OSE/out/win.x86/release/obj/VBoxREM32/exec.o D:/z_Build2/VirtualBox-2.1.4_OSE/out/win.x86/release/obj/VBoxREM32/translate-all.o D:/z_Build2/VirtualBox-2.1.4_OSE/out/win.x86/release/obj/VBoxREM32/host-utils.o D:/z_Build2/VirtualBox-2.1.4_OSE/out/win.x86/release/obj/VBoxREM32/cutils.o D:/z_Build2/VirtualBox-2.1.4_OSE/out/win.x86/release/obj/VBoxREM32/tcg/tcg.o D:/z_Build2/VirtualBox-2.1.4_OSE/out/win.x86/release/obj/VBoxREM32/tcg/tcg-dyngen.o D:/z_Build2/VirtualBox-2.1.4_OSE/out/win.x86/release/obj/VBoxREM32/tcg/tcg-runtime.o D:/z_Build2/VirtualBox-2.1.4_OSE/out/win.x86/release/obj/VBoxREM32/fpu/softfloat-native.o D:/z_Build2/VirtualBox-2.1.4_OSE/out/win.x86/release/obj/VBoxREM32/target-i386/op_helper.o D:/z_Build2/VirtualBox-2.1.4_OSE/out/win.x86/release/obj/VBoxREM32/target-i386/helper.o D:/z_Build2/VirtualBox-2.1.4_OSE/out/win.x86/release/obj/VBoxREM32/target-i386/translate.o  -LD:/z_Build2/mingw/lib D:/z_Build2/VirtualBox-2.1.4_OSE/out/win.x86/release/lib/VBoxVMM.lib   D:/z_Build2/VirtualBox-2.1.4_OSE/out/win.x86/release/lib/VBoxRT.lib


I can't duplicate your problem, but I think it is problem of path for the temporary files.
Please try command of below. (add: --base-file temp.base)
Code: Select all   Expand viewCollapse view
D:/z_Build2/MinGW/bin/dllwrap.exe  -s --base-file temp.base --dllname=D:/z_Build2/VirtualBox-2.1.4_OSE/out/win.x86/release/obj/VBoxREM32/VBoxREM32.dll --output-exp=D:/z_Build2/VirtualBox-2.1.4_OSE/out/win.x86/release/obj/VBoxREM32/VBoxREM32.exp --output-lib=D:/z_Build2/VirtualBox-2.1.4_OSE/out/win.x86/release/obj/VBoxREM32/VBoxREM32.a  --def D:/z_Build2/VirtualBox-2.1.4_OSE/src/recompiler_new/VBoxREM.def  D:/z_Build2/VirtualBox-2.1.4_OSE/out/win.x86/release/obj/VBoxREM32/VBoxRecompiler.o D:/z_Build2/VirtualBox-2.1.4_OSE/out/win.x86/release/obj/VBoxREM32/cpu-exec.o D:/z_Build2/VirtualBox-2.1.4_OSE/out/win.x86/release/obj/VBoxREM32/exec.o D:/z_Build2/VirtualBox-2.1.4_OSE/out/win.x86/release/obj/VBoxREM32/translate-all.o D:/z_Build2/VirtualBox-2.1.4_OSE/out/win.x86/release/obj/VBoxREM32/host-utils.o D:/z_Build2/VirtualBox-2.1.4_OSE/out/win.x86/release/obj/VBoxREM32/cutils.o D:/z_Build2/VirtualBox-2.1.4_OSE/out/win.x86/release/obj/VBoxREM32/tcg/tcg.o D:/z_Build2/VirtualBox-2.1.4_OSE/out/win.x86/release/obj/VBoxREM32/tcg/tcg-dyngen.o D:/z_Build2/VirtualBox-2.1.4_OSE/out/win.x86/release/obj/VBoxREM32/tcg/tcg-runtime.o D:/z_Build2/VirtualBox-2.1.4_OSE/out/win.x86/release/obj/VBoxREM32/fpu/softfloat-native.o D:/z_Build2/VirtualBox-2.1.4_OSE/out/win.x86/release/obj/VBoxREM32/target-i386/op_helper.o D:/z_Build2/VirtualBox-2.1.4_OSE/out/win.x86/release/obj/VBoxREM32/target-i386/helper.o D:/z_Build2/VirtualBox-2.1.4_OSE/out/win.x86/release/obj/VBoxREM32/target-i386/translate.o  -LD:/z_Build2/mingw/lib D:/z_Build2/VirtualBox-2.1.4_OSE/out/win.x86/release/lib/VBoxVMM.lib   D:/z_Build2/VirtualBox-2.1.4_OSE/out/win.x86/release/lib/VBoxRT.lib
yk700101
 
Posts: 43
Joined: 7. Feb 2009, 00:17
Location: Japan
Primary OS: MS Windows Vista
VBox Version: OSE self-compiled
Guest OSses: Debian

--base-file option

Postby alexzeit » 8. Apr 2009, 11:52

Thanks a lot. dllwrap.exe with --base-file temp.base works fine. Is it related to TEMP and TMP folder ? On my PC it is located not on the system drive. In registry it is referenced as "%USERPROFILE%\Lokale Einstellungen\Temp" Is it possible to set TEMP folder in configure.vbs or AutoConfig.kmk for a whole compilation process?
alexzeit
 
Posts: 12
Joined: 3. Apr 2009, 14:39
Primary OS: MS Windows XP
VBox Version: OSE other
Guest OSses: Linux

Re: --base-file option

Postby yk700101 » 8. Apr 2009, 16:55

alexzeit wrote:Is it possible to set TEMP folder in configure.vbs or AutoConfig.kmk for a whole compilation process?


Maybe it is not possible to set TEMP folder ( for dllwrap.exe or dlltool.exe ) in AutoConfig.kmk .
yk700101
 
Posts: 43
Joined: 7. Feb 2009, 00:17
Location: Japan
Primary OS: MS Windows Vista
VBox Version: OSE self-compiled
Guest OSses: Debian

Re: Building VirtualBox OSE 2.1.4 on Windows (use VS2005, Qt4)

Postby alexzeit » 8. Apr 2009, 17:50

But how can I compile VBox then?
alexzeit
 
Posts: 12
Joined: 3. Apr 2009, 14:39
Primary OS: MS Windows XP
VBox Version: OSE other
Guest OSses: Linux

Maybe you can continue.

Postby yk700101 » 9. Apr 2009, 00:26

alexzeit wrote:But how can I compile VBox then?


Maybe you can continue.
Please try below.
Code: Select all   Expand viewCollapse view
cd D:\z_Build2\VirtualBox-2.1.4_OSE

env.bat

set PATH=%PATH%;D:\z_Build2\mingw\bin;
set PATH=%PATH%;D:\z_Build2\qt-win-opensource-src-4.4.3\bin;

kmk > D:\z_Build2\build.vbox.after_error.log 2>&1
yk700101
 
Posts: 43
Joined: 7. Feb 2009, 00:17
Location: Japan
Primary OS: MS Windows Vista
VBox Version: OSE self-compiled
Guest OSses: Debian

Re: Building VirtualBox OSE 2.1.4 on Windows (use VS2005, Qt4)

Postby alexzeit » 9. Apr 2009, 23:17

Please try below.
cd D:\z_Build2\VirtualBox-2.1.4_OSE

env.bat

set PATH=%PATH%;D:\z_Build2\mingw\bin;
set PATH=%PATH%;D:\z_Build2\qt-win-opensource-src-4.4.3\bin;

kmk > D:\z_Build2\build.vbox.after_error.log 2>&1


I tried this but it always stops with the log mentioned in my first thread:

Code: Select all   Expand viewCollapse view
D:/z_Build2/VirtualBox-2.1.4_OSE/src/VBox/Main/webservice/Makefile.kmk:82: VBOX_PATH_GSOAP not found...
...
The failing command:
@D:/z_Build2/MinGW/bin/dllwrap.exe  -s --dllname= ...


where the command "dllwrap.exe -s --base-file temp.base --dllname=..." should be defined?
alexzeit
 
Posts: 12
Joined: 3. Apr 2009, 14:39
Primary OS: MS Windows XP
VBox Version: OSE other
Guest OSses: Linux

Please try to edit MINGW32.kmk

Postby yk700101 » 10. Apr 2009, 15:35

alexzeit wrote:I tried this but it always stops with the log mentioned in my first thread:


Maybe it was stopped by next dll file making.

alexzeit wrote:where the command "dllwrap.exe -s --base-file temp.base --dllname=..." should be defined?


Please search your source files of VirtualBox by 'dllwrap'.
You would find 'D:\z_Build2\VirtualBox-2.1.4_OSE\kBuild\tools\MINGW32.kmk(262)'.
Please try to edit it.
yk700101
 
Posts: 43
Joined: 7. Feb 2009, 00:17
Location: Japan
Primary OS: MS Windows Vista
VBox Version: OSE self-compiled
Guest OSses: Debian

Previous

Return to VirtualBox OSE

Who is online

Users browsing this forum: No registered users and 3 guests